Reaction Details
TargetKallikrein-1
LigandBDBM357172
Substrate/Competitorn/a
Meas. Tech.Kallikrein Assay
Ki 0.740±n/a nM
Citation Xu, JAli, AZhou, WGao, YEdmondson, SDMertz, ENeelamkavil, SFLiu, WSun, WShen, DHarper, BZhu, CBara, TLim, YYang, M Factor XIA inhibitors US Patent US10214512 Publication Date 2/26/2019
 
Kallikrein-1
Name:Kallikrein-1
Type:Enzyme
Mol. Mass.:28874.69
Organism:Homo sapiens (Human)
Description:P06870
Residue:262
BDBM357172
NameBDBM357172
Synonyms:US10214512, Example 128
TypeSmall organic molecule
Emp. Form.C27H24ClF2N5O2
Mol. Mass.523.962
SMILESCc1[nH]c2nc1-c1ccc(N)cc1NC(=O)CCCC[C@@H]2c1ccc(c[n+]1[O-])-c1c(F)ccc(Cl)c1F