Reaction Details
TargetKallikrein-1
LigandBDBM357173
Substrate/Competitorn/a
Meas. Tech.Kallikrein Assay
Ki 1.72±n/a nM
Citation Xu, JAli, AZhou, WGao, YEdmondson, SDMertz, ENeelamkavil, SFLiu, WSun, WShen, DHarper, BZhu, CBara, TLim, YYang, M Factor XIA inhibitors US Patent US10214512 Publication Date 2/26/2019
 
Kallikrein-1
Name:Kallikrein-1
Type:Enzyme
Mol. Mass.:28874.69
Organism:Homo sapiens (Human)
Description:P06870
Residue:262
BDBM357173
NameBDBM357173
Synonyms:US10214512, Example 129
TypeSmall organic molecule
Emp. Form.C30H28F3N5O5
Mol. Mass.595.569
SMILESCOC(=O)Nc1ccc2-c3nc([nH]c3C)[C@H](CCCCC(=O)Nc2c1)c1ccc(c[n+]1[O-])-c1cc(F)ccc1OC(F)F