Reaction Details
TargetFibroblast growth factor receptor 3
LigandBDBM357249
Substrate/Competitorn/a
Meas. Tech.Determination of the Effects of the Compounds of the Present Invention on FGFR Kinase Activity
IC50 26.0±n/a nM
Citation Chen, LGuan, DBai, HYan, XMiao, SZhu, S Substituted pyrazoles as inhibitors of fibroblast growth factor receptor US Patent US10214515 Publication Date 2/26/2019
 
Fibroblast growth factor receptor 3
Name:Fibroblast growth factor receptor 3
Type:Protein
Mol. Mass.:87699.57
Organism:Homo sapiens (Human)
Description:P22607
Residue:806
BDBM357249
NameBDBM357249
Synonyms:(5-amino-1-(2-cyclopropyl-1H-benzo[d]imidazol-5-yl)-1H-pyrazol-4-yl)(5-fluoro-1H-indol-2-yl)methanone | US10214515, Example 11
TypeSmall organic molecule
Emp. Form.C22H17FN6O
Mol. Mass.400.4084
SMILESNc1c(cnn1-c1ccc2[nH]c(nc2c1)C1CC1)C(=O)c1cc2cc(F)ccc2[nH]1