Reaction Details
TargetFibroblast growth factor receptor 1
LigandBDBM357253
Substrate/Competitorn/a
Meas. Tech.Determination of the Effects of the Compounds of the Present Invention on FGFR Kinase Activity
IC50 4.90±n/a nM
Citation Chen, LGuan, DBai, HYan, XMiao, SZhu, S Substituted pyrazoles as inhibitors of fibroblast growth factor receptor US Patent US10214515 Publication Date 2/26/2019
 
Fibroblast growth factor receptor 1
Name:Fibroblast growth factor receptor 1
Type:Receptor
Mol. Mass.:91861.70
Organism:Homo sapiens (Human)
Description:P11362
Residue:822
BDBM357253
NameBDBM357253
Synonyms:(5-Amino-1-(2-cyclopropyl-1H-benzo[d]imidazol-5-yl)-1H-pyrazol-4-yl)(6-(1-ethyl-1H-pyrazol-4-yl)-1H-indol-2-yl)methanone | US10214515, Example 16
TypeSmall organic molecule
Emp. Form.C27H24N8O
Mol. Mass.476.5325
SMILESCCn1cc(cn1)-c1ccc2cc([nH]c2c1)C(=O)c1cnn(c1N)-c1ccc2[nH]c(nc2c1)C1CC1