Reaction Details
TargetMethionine aminopeptidase 2
LigandBDBM17847
Substrate/CompetitorBDBM17848
Meas. Tech.MetAP Inhibition Assay
pH7.5±n/a
Temperature295.15±n/a K
IC50>300000±n/a nM
Citation Hu, XAddlagatta, ALu, JMatthews, BWLiu, JO Elucidation of the function of type 1 human methionine aminopeptidase during cell cycle progression. Proc Natl Acad Sci U S A103:18148-53 (2006) 
 
Methionine aminopeptidase 2
Name:Methionine aminopeptidase 2
Type:Enzyme
Mol. Mass.:52884.45
Organism:Homo sapiens (Human)
Description:P50579
Residue:478
BDBM17847
BDBM17848
NameBDBM17847
Synonyms:CHEMBL327579 tert-butyl N-[2-(1,3-thiazol-2-ylcarbamoyl)pyridin-3-yl]carbamate
TypeSmall organic molecule
Emp. Form.C14H16N4O3S
Mol. Mass.320.367
SMILESCC(C)(C)OC(=O)Nc1cccnc1C(=O)Nc1nccs1