Reaction Details
TargetDual specificity protein kinase TTK
LigandBDBM228273
Substrate/Competitorn/a
Meas. Tech.Mps-1 Kinase Assay
pH7.7±n/a
IC50<1.000±n/a nM
Commentsextracted
Citation Schulze, VKosemund, DSchirok, HBader, BLienau, PWengner, AMBriem, HHolton, SSiemeister, GPrechtl, SKoppitz, MStöckigt, DPrien, O Substituted triazolopyridines US Patent US9555022 Publication Date 1/31/2017
 
Dual specificity protein kinase TTK
Name:Dual specificity protein kinase TTK
Type:Protein
Mol. Mass.:97086.79
Organism:Homo sapiens (Human)
Description:P33981
Residue:857
BDBM228273
NameBDBM228273
Synonyms:US9555022, Example 02.11
TypeSmall organic molecule
Emp. Form.C30H25FN6O4
Mol. Mass.552.5557
SMILESCOc1cc(ccc1Nc1nc2ccc(cn2n1)-c1ccc(NC(=O)Cc2ccc(F)cc2)cc1)N1CCOC1=O