Reaction Details
TargetDual specificity protein kinase TTK
LigandBDBM228351
Substrate/Competitorn/a
Meas. Tech.Mps-1 Kinase Assay
pH7.7±n/a
IC50<1.000±n/a nM
Commentsextracted
Citation Schulze, VKosemund, DSchirok, HBader, BLienau, PWengner, AMBriem, HHolton, SSiemeister, GPrechtl, SKoppitz, MStöckigt, DPrien, O Substituted triazolopyridines US Patent US9555022 Publication Date 1/31/2017
 
Dual specificity protein kinase TTK
Name:Dual specificity protein kinase TTK
Type:Protein
Mol. Mass.:97086.79
Organism:Homo sapiens (Human)
Description:P33981
Residue:857
BDBM228351
NameBDBM228351
Synonyms:US9555022, Example 04.19
TypeSmall organic molecule
Emp. Form.C35H38FN7O2
Mol. Mass.607.7203
SMILESCOc1cc(ccc1Nc1nc2ccc(cn2n1)-c1ccc(cc1)C(=O)NCc1ccc(F)cc1)N1CCN(CC1)C(C)(C)C