Reaction Details
TargetDual specificity protein kinase TTK
LigandBDBM228377
Substrate/Competitorn/a
Meas. Tech.Mps-1 Kinase Assay
pH7.7±n/a
IC50<1.000±n/a nM
Commentsextracted
Citation Schulze, VKosemund, DSchirok, HBader, BLienau, PWengner, AMBriem, HHolton, SSiemeister, GPrechtl, SKoppitz, MStöckigt, DPrien, O Substituted triazolopyridines US Patent US9555022 Publication Date 1/31/2017
 
Dual specificity protein kinase TTK
Name:Dual specificity protein kinase TTK
Type:Protein
Mol. Mass.:97086.79
Organism:Homo sapiens (Human)
Description:P33981
Residue:857
BDBM228377
NameBDBM228377
Synonyms:US9555022, Example 06.02
TypeSmall organic molecule
Emp. Form.C32H30F2N6O3
Mol. Mass.584.6158
SMILESCOc1cc(CN2CCOCC2)ccc1Nc1nc2ccc(cn2n1)-c1ccc(C(=O)NCc2ccc(F)cc2)c(F)c1