Reaction Details
TargetDual specificity protein kinase TTK
LigandBDBM228387
Substrate/Competitorn/a
Meas. Tech.Mps-1 Kinase Assay
pH7.7±n/a
IC50<1.000±n/a nM
Commentsextracted
Citation Schulze, VKosemund, DSchirok, HBader, BLienau, PWengner, AMBriem, HHolton, SSiemeister, GPrechtl, SKoppitz, MStöckigt, DPrien, O Substituted triazolopyridines US Patent US9555022 Publication Date 1/31/2017
 
Dual specificity protein kinase TTK
Name:Dual specificity protein kinase TTK
Type:Protein
Mol. Mass.:97086.79
Organism:Homo sapiens (Human)
Description:P33981
Residue:857
BDBM228387
NameBDBM228387
Synonyms:US9555022, Example 11.02
TypeSmall organic molecule
Emp. Form.C32H30FN7O4
Mol. Mass.595.6235
SMILESCCOc1cc(ccc1Nc1nc2ccc(cn2n1)-c1ccc(NC(=O)Cc2ccc(F)cc2)nc1)C(=O)N1CCOCC1