Reaction Details
TargetMajor prion protein
LigandBDBM357273
Substrate/Competitorn/a
Meas. Tech.Human Platelet Aggregation Inhibition Test
IC50 70.0±n/a nM
Citation Tran, TIbarra, JBShin, YUllman, BZou, NZeng, X Pyrazolyl substituted carbonic acid derivatives as modulators of the prostacyclin (PGI2) receptor useful for the treatment of disorders related thereto US Patent US10214518 Publication Date 2/26/2019
 
Major prion protein
Name:Major prion protein
Type:PROTEIN
Mol. Mass.:27671.97
Organism:Homo sapiens (Human)
Description:ChEMBL_158887
Residue:253
BDBM357273
NameBDBM357273
Synonyms:2-(((1s,4s)-4-((5-(2- hydroxyethylthio)-3,4- diphenyl-1H-pyrazol-1- yl)methyl)cyclohexyl) methoxy)acetic acid | US10214518, Compound 146
TypeSmall organic molecule
Emp. Form.C27H32N2O4S
Mol. Mass.480.619
SMILESOCCSc1c(c(nn1C[C@@H]1CC[C@H](COCC(O)=O)CC1)-c1ccccc1)-c1ccccc1