Reaction Details
TargetCarbonic anhydrase 9
LigandBDBM50387124
Substrate/Competitorn/a
Ki 27±n/a nM
Citation Sethi, KKVerma, SM A systematic quantitative approach to rational drug design and discovery of novel human carbonic anhydrase IX inhibitors. J Enzyme Inhib Med Chem29:571-81 (2014) 
 
Carbonic anhydrase 9
Name:Carbonic anhydrase 9
Type:Enzyme
Mol. Mass.:49669.03
Organism:Homo sapiens (Human)
Description:Catalytic domain of human cloned isozyme was used in the assay
Residue:459
BDBM50387124
NameBDBM50387124
Synonyms:4-ureidophenyl sulfamate ring derivative 3i | CHEMBL2047804
TypeSmall organic molecule
Emp. Form.C19H17N3O5S
Mol. Mass.399.42
SMILESNS(=O)(=O)Oc1ccc(NC(=O)Nc2ccc(Oc3ccccc3)cc2)cc1