Reaction Details
TargetCarbonic anhydrase 9
LigandBDBM50387125
Substrate/Competitorn/a
Ki 6.0±n/a nM
Citation Sethi, KKVerma, SM A systematic quantitative approach to rational drug design and discovery of novel human carbonic anhydrase IX inhibitors. J Enzyme Inhib Med Chem29:571-81 (2014) 
 
Carbonic anhydrase 9
Name:Carbonic anhydrase 9
Type:Enzyme
Mol. Mass.:49669.03
Organism:Homo sapiens (Human)
Description:Catalytic domain of human cloned isozyme was used in the assay
Residue:459
BDBM50387125
NameBDBM50387125
Synonyms:4-ureidophenyl sulfamate ring derivative 3j | CHEMBL2047805
TypeSmall organic molecule
Emp. Form.C13H8F5N3O4S
Mol. Mass.397.277
SMILESNS(=O)(=O)Oc1ccc(NC(=O)Nc2c(F)c(F)c(F)c(F)c2F)cc1