Reaction Details
TargetLysine-specific histone demethylase 1A
LigandBDBM151608
Substrate/Competitorn/a
Meas. Tech.LSD1 Histone Demethylase Assay
IC50 13.0±n/a nM
Citation Vankayalapati, HSorna, VWarner, SLStephens, BBearss, DJSharma, S Substituted (E)-N′-(1-phenylethylidene)benzohydrazide analogs as histone demethylase inhibitors US Patent US9555024 Publication Date 1/31/2017
 
Lysine-specific histone demethylase 1A
Name:Lysine-specific histone demethylase 1A
Type:Enzyme
Mol. Mass.:92901.01
Organism:Homo sapiens (Human)
Description:O60341
Residue:852
BDBM151608
NameBDBM151608
Synonyms:US8987335, 9 | US9555024, 9
TypeSmall organic molecule
Emp. Form.C18H18FN3O6S
Mol. Mass.423.415
SMILESOc1ccccc1C(=O)NNC(=O)c1cc(ccc1F)S(=O)(=O)N1CCOCC1