Reaction Details
TargetGlycine--tRNA ligase
LigandBDBM2
Substrate/CompetitorBDBM18133
Meas. Tech.In Vitro Enzyme Activity Assay
pH7.5±n/a
Temperature298.15±n/a K
Ki 13000±6000 nM
IC50 100000±n/a nM
Citation Dignam, JDNada, SChaires, JB Thermodynamic characterization of the binding of nucleotides to glycyl-tRNA synthetase. Biochemistry42:5333-40 (2003) 
 
Glycine--tRNA ligase
Name:Glycine--tRNA ligase
Type:Enzyme
Mol. Mass.:76917.70
Organism:Bombyx mori
Description:B. mori glycyltRNA synthetase was expressed in E. coli.
Residue:680
BDBM2
BDBM18133
NameBDBM2
Synonyms:({[({[(2R,3S,4R,5R)-5-(6-amino-9H-purin-9-yl)-3,4-dihydroxyoxolan-2-yl]methoxy}(hydroxy)phosphoryl)oxy](hydroxy)phosphoryl}oxy)phosphonic acid Brimonidine ATP | CHEMBL14249
TypeNucleoside or nucleotide
Emp. Form.C10H16N5O13P3
Mol. Mass.507.181
SMILESNc1ncnc2n(cnc12)[C@@H]1O[C@H](COP(O)(=O)OP(O)(=O)OP(O)(O)=O)[C@@H](O)[C@H]1O