Reaction Details
TargetAndrogen receptor
LigandBDBM18195
Substrate/CompetitorBDBM18161
Meas. Tech.AR Transcriptional Activation Assay and MDA Whole-Cell Binding Assay
pH7.4±n/a
Temperature310.15±n/a K
Ki 17±14 nM
EC50 3.2±0.6 nM
Commentsefficacy=70 +/- 11 % for hAR agonist, efficacy=27 +/- 27 % for hAR antagonist.
Citation Higuchi, RIArienti, KLLópez, FJMani, NSMais, DECaferro, TRLong, YOJones, TKEdwards, JPZhi, LSchrader, WTNegro-Vilar, AMarschke, KB Novel series of potent, nonsteroidal, selective androgen receptor modulators based on 7H-[1,4]oxazino[3,2-g]quinolin-7-ones. J Med Chem50:2486-96 (2007) 
 
Androgen receptor
Name:Androgen receptor
Type:Receptor
Mol. Mass.:99185.27
Organism:Homo sapiens (Human)
Description:CHO cells were stably transfected with human AR gene.
Residue:920
BDBM18195
BDBM18161
NameBDBM18195
Synonyms:1-(2-methylpropyl)-9-(trifluoromethyl)-1H,2H,3H,6H,7H-quinolino[7,6-b][1,4]oxazin-7-one | 7H-[1,4]Oxazino[3,2-g]quinolin-7-one based compound, 10d
TypeSmall organic molecule
Emp. Form.C16H17F3N2O2
Mol. Mass.326.3136
SMILESCC(C)CN1CCOc2cc3[nH]c(=O)cc(c3cc12)C(F)(F)F