Reaction Details
TargetAndrogen receptor
LigandBDBM18198
Substrate/CompetitorBDBM18161
Meas. Tech.AR Transcriptional Activation Assay and MDA Whole-Cell Binding Assay
pH7.4±n/a
Temperature310.15±n/a K
Ki 1.6±0.2 nM
EC50 1.4±0.3 nM
Commentsefficacy=68 +/- 5 %.
Citation Higuchi, RIArienti, KLLópez, FJMani, NSMais, DECaferro, TRLong, YOJones, TKEdwards, JPZhi, LSchrader, WTNegro-Vilar, AMarschke, KB Novel series of potent, nonsteroidal, selective androgen receptor modulators based on 7H-[1,4]oxazino[3,2-g]quinolin-7-ones. J Med Chem50:2486-96 (2007) 
 
Androgen receptor
Name:Androgen receptor
Type:Receptor
Mol. Mass.:99185.27
Organism:Homo sapiens (Human)
Description:CHO cells were stably transfected with human AR gene.
Residue:920
BDBM18198
BDBM18161
NameBDBM18198
Synonyms:1-(cyclopropylmethyl)-9-(trifluoromethyl)-1H,2H,3H,6H,7H-quinolino[7,6-b][1,4]oxazin-7-one | 7H-[1,4]Oxazino[3,2-g]quinolin-7-one based compound, 12a
TypeSmall organic molecule
Emp. Form.C16H15F3N2O2
Mol. Mass.324.2977
SMILESFC(F)(F)c1cc(=O)[nH]c2cc3OCCN(CC4CC4)c3cc12