Reaction Details
TargetBeta-secretase 1
LigandBDBM228399
Substrate/Competitorn/a
Meas. Tech.In Vivo Inhibition of Beta-Secretase
IC50 0.590±n/a nM
Citation Lewis, RTAllen, JRCheng, YChoquette, DEpstein, OGuzman-Perez, AHarrington, PEHua, ZHungate, RWHuman, JBJudd, TLiu, QLopez, PMinatti, AEOlivieri, PRomero, KRumfelt, SRzasa, RMSchenkel, LStellwagen, JWhite, RXue, QZheng, XMZhong, W Amino-dihydrothiazine and amino-dioxido dihydrothiazine compounds as beta-secretase antagonists and methods of use US Patent US9556135 Publication Date 1/31/2017
 
Beta-secretase 1
Name:Beta-secretase 1
Type:Protein
Mol. Mass.:55755.10
Organism:Homo sapiens (Human)
Description:P56817
Residue:501
BDBM228399
NameBDBM228399
Synonyms:US9556135, 45
TypeSmall organic molecule
Emp. Form.C21H21ClFN5O2S
Mol. Mass.461.94
SMILESCC1(C)C(N)=N[C@@](C)(CS1(=O)=O)c1cc(Nc2nccc3cc(Cl)cnc23)ccc1F