Reaction Details
TargetCathepsin D
LigandBDBM50012660
Substrate/Competitorn/a
Meas. Tech.In Vitro Enzymatic
pH3.5±n/a
IC50 240000±n/a nM
Commentsextracted
Citation Lewis, RTAllen, JRCheng, YChoquette, DEpstein, OGuzman-Perez, AHarrington, PEHua, ZHungate, RWHuman, JBJudd, TLiu, QLopez, PMinatti, AEOlivieri, PRomero, KRumfelt, SRzasa, RMSchenkel, LStellwagen, JWhite, RXue, QZheng, XMZhong, W Amino-dihydrothiazine and amino-dioxido dihydrothiazine compounds as beta-secretase antagonists and methods of use US Patent US9556135 Publication Date 1/31/2017
 
Cathepsin D
Name:Cathepsin D
Type:Enzyme
Mol. Mass.:44551.72
Organism:Homo sapiens (Human)
Description:Human proCathepsin D (SwissProt accession number P07339) was expressed in Sf9 cells, purified, and autoactivated.
Residue:412
BDBM50012660
NameBDBM50012660
Synonyms:CHEMBL3261078 US9556135, 19
TypeSmall organic molecule
Emp. Form.C19H20ClFN4O3S
Mol. Mass.438.904
SMILESCC1(C)C(N)=N[C@@](C)(CS1(=O)=O)c1cc(NC(=O)c2ccc(Cl)cn2)ccc1F