Reaction Details
TargetCathepsin D
LigandBDBM228479
Substrate/Competitorn/a
Meas. Tech.In Vitro Enzymatic
pH3.5±n/a
IC50 28000±n/a nM
Commentsextracted
Citation Lewis, RTAllen, JRCheng, YChoquette, DEpstein, OGuzman-Perez, AHarrington, PEHua, ZHungate, RWHuman, JBJudd, TLiu, QLopez, PMinatti, AEOlivieri, PRomero, KRumfelt, SRzasa, RMSchenkel, LStellwagen, JWhite, RXue, QZheng, XMZhong, W Amino-dihydrothiazine and amino-dioxido dihydrothiazine compounds as beta-secretase antagonists and methods of use US Patent US9556135 Publication Date 1/31/2017
 
Cathepsin D
Name:Cathepsin D
Type:Enzyme
Mol. Mass.:44551.72
Organism:Homo sapiens (Human)
Description:Human proCathepsin D (SwissProt accession number P07339) was expressed in Sf9 cells, purified, and autoactivated.
Residue:412
BDBM228479
NameBDBM228479
Synonyms:US9556135, 205
TypeSmall organic molecule
Emp. Form.C20H19ClF2N4O3S
Mol. Mass.468.905
SMILESCc1cc(Cl)cnc1C(=O)Nc1ccc(F)c(c1)[C@@]1(C)N=C(N)C2(CC2)S(=O)(=O)[C@H]1F