Reaction Details
TargetBeta-secretase 1
LigandBDBM229990
Substrate/Competitorn/a
Meas. Tech.In Vivo Inhibition of Beta-Secretase
IC50 0.560±n/a nM
Citation Lewis, RTAllen, JRCheng, YChoquette, DEpstein, OGuzman-Perez, AHarrington, PEHua, ZHungate, RWHuman, JBJudd, TLiu, QLopez, PMinatti, AEOlivieri, PRomero, KRumfelt, SRzasa, RMSchenkel, LStellwagen, JWhite, RXue, QZheng, XMZhong, W Amino-dihydrothiazine and amino-dioxido dihydrothiazine compounds as beta-secretase antagonists and methods of use US Patent US9556135 Publication Date 1/31/2017
 
Beta-secretase 1
Name:Beta-secretase 1
Type:Protein
Mol. Mass.:55755.10
Organism:Homo sapiens (Human)
Description:P56817
Residue:501
BDBM229990
NameBDBM229990
Synonyms:US9556135, 157
TypeSmall organic molecule
Emp. Form.C22H19F3N6O2S
Mol. Mass.488.485
SMILESCC1(C)C(N)=N[C@@](CF)(CS1(=O)=O)c1cc(Nc2ncc(F)c3cc(cnc23)[N+]#[C-])ccc1F