Reaction Details
TargetNeuronal acetylcholine receptor subunit alpha-7
LigandBDBM165936
Substrate/Competitorn/a
Meas. Tech.The [3H]-methyllycaconitine binding assay
Ki 14.0±n/a nM
Citation Luithle, JBöβ, FErb, CHafner, FSchnizler, KFlessner, TVan Kampen, MVan Der Staay, F 2-heteroaryl carboxamides US Patent US10214524 Publication Date 2/26/2019
 
Neuronal acetylcholine receptor subunit alpha-7
Name:Neuronal acetylcholine receptor subunit alpha-7
Type:Enzyme
Mol. Mass.:56502.44
Organism:Rattus norvegicus (Rat)
Description:Q05941
Residue:502
BDBM165936
NameBDBM165936
Synonyms:US10214524, Example 163 | US9067931, 163
TypeSmall organic molecule
Emp. Form.C28H32N4O3
Mol. Mass.472.5787
SMILESCN1CCN(CC1)C(=O)c1cccc(c1)-c1cccc2cc(oc12)C(=O)N[C@H]1CN2CCC1CC2