Reaction Details
TargetDihydrofolate reductase
LigandBDBM18248
Substrate/CompetitorBDBM18044
Meas. Tech.Dihydrofolate Reductase (DHFR) Assay
pH7.4±n/a
Temperature303.15±n/a K
IC50 150±n/a nM
Citation Gangjee, AZeng, YTalreja, TMcGuire, JJKisliuk, RLQueener, SF Design and Synthesis of Classical and Nonclassical 6-Arylthio-2,4-diamino-5-ethylpyrrolo[2,3-d]pyrimidines as Antifolates. J Med Chem50:3046-3053 (2007) 
 
Dihydrofolate reductase
Name:Dihydrofolate reductase
Type:Enzyme
Mol. Mass.:17991.61
Organism:Escherichia coli
Description:E. coli DHFR was expressed in BL21, and purified to homogeneity.
Residue:159
BDBM18248
BDBM18044
NameBDBM18248
Synonyms:5-ethyl-6-(naphthalen-2-ylsulfanyl)-7H-pyrrolo[2,3-d]pyrimidine-2,4-diamine | Pyrrolo[2, 3-d]pyrimidine analogue, 4
TypeSmall organic molecule
Emp. Form.C18H17N5S
Mol. Mass.335.426
SMILESCCc1c(Sc2ccc3ccccc3c2)[nH]c2nc(N)nc(N)c12