Reaction Details
TargetDihydrofolate reductase
LigandBDBM18249
Substrate/CompetitorBDBM18044
Meas. Tech.Dihydrofolate Reductase (DHFR) Assay
pH7.4±n/a
Temperature303.15±n/a K
IC50 90±n/a nM
Citation Gangjee, AZeng, YTalreja, TMcGuire, JJKisliuk, RLQueener, SF Design and Synthesis of Classical and Nonclassical 6-Arylthio-2,4-diamino-5-ethylpyrrolo[2,3-d]pyrimidines as Antifolates. J Med Chem50:3046-3053 (2007) 
 
Dihydrofolate reductase
Name:Dihydrofolate reductase
Type:Enzyme
Mol. Mass.:17991.61
Organism:Escherichia coli
Description:E. coli DHFR was expressed in BL21, and purified to homogeneity.
Residue:159
BDBM18249
BDBM18044
NameBDBM18249
Synonyms:5-ethyl-6-[(4-nitrophenyl)sulfanyl]-7H-pyrrolo[2,3-d]pyrimidine-2,4-diamine | Pyrrolo[2, 3-d]pyrimidine analogue, 5
TypeSmall organic molecule
Emp. Form.C14H14N6O2S
Mol. Mass.330.365
SMILESCCc1c(Sc2ccc(cc2)[N+]([O-])=O)[nH]c2nc(N)nc(N)c12