Reaction Details
TargetDihydrofolate reductase
LigandBDBM18257
Substrate/CompetitorBDBM18044
Meas. Tech.Dihydrofolate Reductase (DHFR) Assay
pH7.4±n/a
Temperature303.15±n/a K
IC50 170±n/a nM
Citation Gangjee, AZeng, YTalreja, TMcGuire, JJKisliuk, RLQueener, SF Design and Synthesis of Classical and Nonclassical 6-Arylthio-2,4-diamino-5-ethylpyrrolo[2,3-d]pyrimidines as Antifolates. J Med Chem50:3046-3053 (2007) 
 
Dihydrofolate reductase
Name:Dihydrofolate reductase
Type:Enzyme
Mol. Mass.:17991.61
Organism:Escherichia coli
Description:E. coli DHFR was expressed in BL21, and purified to homogeneity.
Residue:159
BDBM18257
BDBM18044
NameBDBM18257
Synonyms:5-ethyl-6-(phenylsulfanyl)-7H-pyrrolo[2,3-d]pyrimidine-2,4-diamine | Pyrrolo[2, 3-d]pyrimidine analogue, 15
TypeSmall organic molecule
Emp. Form.C14H15N5S
Mol. Mass.285.367
SMILESCCc1c(Sc2ccccc2)[nH]c2nc(N)nc(N)c12