Reaction Details
TargetPhosphatidylinositol 4,5-bisphosphate 3-kinase catalytic subunit delta isoform
LigandBDBM358159
Substrate/Competitorn/a
Meas. Tech.ADP-Glo Format PI3K Assay
IC50 0.400±n/a nM
Citation Bhide, RSBatt, DGCherney, RJCornelius, LALiu, QMarcoux, DNeels, JPoss, MARuan, ZShi, QSrivastava, ASQin, LTino, JAWatterson, SH Bicyclic heteroaryl amine compounds US Patent US10214537 Publication Date 2/26/2019
 
Phosphatidylinositol 4,5-bisphosphate 3-kinase catalytic subunit delta isoform
Name:Phosphatidylinositol 4,5-bisphosphate 3-kinase catalytic subunit delta isoform
Type:Enzyme Subunit
Mol. Mass.:119489.41
Organism:Homo sapiens (Human)
Description:O00329
Residue:1044
BDBM358159
NameBDBM358159
Synonyms:1-((cis)-4-(3-(4-amino-5-(1-(tetrahydro-2H-pyran-4-yl)-1H-1,2,3-triazol-5-yl)pyrrolo[2,1-f][1,2,4]triazin-7-yl)-5-methylphenyl)-3,5-dimethylpiperazin-1-yl)ethanone | US10214537, Example 228
TypeSmall organic molecule
Emp. Form.C28H35N9O2
Mol. Mass.529.6366
SMILESC[C@H]1CN(C[C@@H](C)N1c1cc(C)cc(c1)-c1cc(-c2cnnn2C2CCOCC2)c2c(N)ncnn12)C(C)=O