Reaction Details
TargetPhosphatidylinositol 4,5-bisphosphate 3-kinase catalytic subunit delta isoform
LigandBDBM50232445
Substrate/Competitorn/a
Meas. Tech.ADP-Glo Format PI3K Assay
IC50 1.000±n/a nM
Citation Bhide, RSBatt, DGCherney, RJCornelius, LALiu, QMarcoux, DNeels, JPoss, MARuan, ZShi, QSrivastava, ASQin, LTino, JAWatterson, SH Bicyclic heteroaryl amine compounds US Patent US10214537 Publication Date 2/26/2019
 
Phosphatidylinositol 4,5-bisphosphate 3-kinase catalytic subunit delta isoform
Name:Phosphatidylinositol 4,5-bisphosphate 3-kinase catalytic subunit delta isoform
Type:Enzyme Subunit
Mol. Mass.:119489.41
Organism:Homo sapiens (Human)
Description:O00329
Residue:1044
BDBM50232445
NameBDBM50232445
Synonyms:CHEMBL4062954 | US10214537, Example 290
TypeSmall organic molecule
Emp. Form.C25H30N8O
Mol. Mass.458.5587
SMILESCN1CCN(CC1)c1cccc(c1)-c1cc(-c2ccnn2C2CCOCC2)c2c(N)ncnn12