Reaction Details
TargetPhosphatidylinositol 4,5-bisphosphate 3-kinase catalytic subunit delta isoform
LigandBDBM50239736
Substrate/Competitorn/a
Meas. Tech.ADP-Glo Format PI3K Assay
IC50 1.000±n/a nM
Citation Bhide, RSBatt, DGCherney, RJCornelius, LALiu, QMarcoux, DNeels, JPoss, MARuan, ZShi, QSrivastava, ASQin, LTino, JAWatterson, SH Bicyclic heteroaryl amine compounds US Patent US10214537 Publication Date 2/26/2019
 
Phosphatidylinositol 4,5-bisphosphate 3-kinase catalytic subunit delta isoform
Name:Phosphatidylinositol 4,5-bisphosphate 3-kinase catalytic subunit delta isoform
Type:Enzyme Subunit
Mol. Mass.:119489.41
Organism:Homo sapiens (Human)
Description:O00329
Residue:1044
BDBM50239736
NameBDBM50239736
Synonyms:CHEMBL4074315 | US10214537, Example 637
TypeSmall organic molecule
Emp. Form.C21H20ClN7O2
Mol. Mass.437.882
SMILESCC(=O)N1CCN(C(=O)C1(C)C)c1cc(ccc1C#N)-c1cc(Cl)c2c(N)ncnn12