Reaction Details
TargetPhosphatidylinositol 4,5-bisphosphate 3-kinase catalytic subunit delta isoform
LigandBDBM50239733
Substrate/Competitorn/a
Meas. Tech.ADP-Glo Format PI3K Assay
IC50 2.00±n/a nM
Citation Bhide, RSBatt, DGCherney, RJCornelius, LALiu, QMarcoux, DNeels, JPoss, MARuan, ZShi, QSrivastava, ASQin, LTino, JAWatterson, SH Bicyclic heteroaryl amine compounds US Patent US10214537 Publication Date 2/26/2019
 
Phosphatidylinositol 4,5-bisphosphate 3-kinase catalytic subunit delta isoform
Name:Phosphatidylinositol 4,5-bisphosphate 3-kinase catalytic subunit delta isoform
Type:Enzyme Subunit
Mol. Mass.:119489.41
Organism:Homo sapiens (Human)
Description:O00329
Residue:1044
BDBM50239733
NameBDBM50239733
Synonyms:CHEMBL4070029 | US10214537, Example 594
TypeSmall organic molecule
Emp. Form.C21H23ClN6O3
Mol. Mass.442.899
SMILESCOc1ccc(cc1N1CCN(C(C)=O)C(C)(C)C1=O)-c1cc(Cl)c2c(N)ncnn12