Reaction Details
TargetPhosphatidylinositol 4,5-bisphosphate 3-kinase catalytic subunit delta isoform
LigandBDBM50239747
Substrate/Competitorn/a
Meas. Tech.ADP-Glo Format PI3K Assay
IC50 4.00±n/a nM
Citation Bhide, RSBatt, DGCherney, RJCornelius, LALiu, QMarcoux, DNeels, JPoss, MARuan, ZShi, QSrivastava, ASQin, LTino, JAWatterson, SH Bicyclic heteroaryl amine compounds US Patent US10214537 Publication Date 2/26/2019
 
Phosphatidylinositol 4,5-bisphosphate 3-kinase catalytic subunit delta isoform
Name:Phosphatidylinositol 4,5-bisphosphate 3-kinase catalytic subunit delta isoform
Type:Enzyme Subunit
Mol. Mass.:119489.41
Organism:Homo sapiens (Human)
Description:O00329
Residue:1044
BDBM50239747
NameBDBM50239747
Synonyms:CHEMBL4064543 | US10214537, Example 600
TypeSmall organic molecule
Emp. Form.C21H21F3N6O2
Mol. Mass.446.4256
SMILESCC(=O)N1CCN(C(=O)C1(C)C)c1cccc(c1)-c1cc(c2c(N)ncnn12)C(F)(F)F