Reaction Details
TargetPhosphatidylinositol 4,5-bisphosphate 3-kinase catalytic subunit delta isoform
LigandBDBM50239734
Substrate/Competitorn/a
Meas. Tech.ADP-Glo Format PI3K Assay
IC50 3.00±n/a nM
Citation Bhide, RSBatt, DGCherney, RJCornelius, LALiu, QMarcoux, DNeels, JPoss, MARuan, ZShi, QSrivastava, ASQin, LTino, JAWatterson, SH Bicyclic heteroaryl amine compounds US Patent US10214537 Publication Date 2/26/2019
 
Phosphatidylinositol 4,5-bisphosphate 3-kinase catalytic subunit delta isoform
Name:Phosphatidylinositol 4,5-bisphosphate 3-kinase catalytic subunit delta isoform
Type:Enzyme Subunit
Mol. Mass.:119489.41
Organism:Homo sapiens (Human)
Description:O00329
Residue:1044
BDBM50239734
NameBDBM50239734
Synonyms:CHEMBL4097222 | US10214537, Example 628
TypeSmall organic molecule
Emp. Form.C20H20Cl2N6O2
Mol. Mass.447.318
SMILESCC(=O)N1CCN(C(=O)C1(C)C)c1cc(ccc1Cl)-c1cc(Cl)c2c(N)ncnn12