Reaction Details
TargetPhosphatidylinositol 4,5-bisphosphate 3-kinase catalytic subunit delta isoform
LigandBDBM358623
Substrate/Competitorn/a
Meas. Tech.ADP-Glo Format PI3K Assay
IC50 0.500±n/a nM
Citation Bhide, RSBatt, DGCherney, RJCornelius, LALiu, QMarcoux, DNeels, JPoss, MARuan, ZShi, QSrivastava, ASQin, LTino, JAWatterson, SH Bicyclic heteroaryl amine compounds US Patent US10214537 Publication Date 2/26/2019
 
Phosphatidylinositol 4,5-bisphosphate 3-kinase catalytic subunit delta isoform
Name:Phosphatidylinositol 4,5-bisphosphate 3-kinase catalytic subunit delta isoform
Type:Enzyme Subunit
Mol. Mass.:119489.41
Organism:Homo sapiens (Human)
Description:O00329
Residue:1044
BDBM358623
NameBDBM358623
Synonyms:(R)-4-(3-(4-amino-5-(1-(2,2,2- trifluoroethyl)-1H-pyrazol-5-yl)pyrrolo [2,1-f][1,2,4]triazin-7-yl)phenyl)-2,2,5- trimethylmorpholin-3-one US10214537, Example 703
TypeSmall organic molecule
Emp. Form.C24H24F3N7O2
Mol. Mass.499.4883
SMILESC[C@@H]1COC(C)(C)C(=O)N1c1cccc(c1)-c1cc(-c2ccnn2CC(F)(F)F)c2c(N)ncnn12