Reaction Details
TargetPhosphatidylinositol 4,5-bisphosphate 3-kinase catalytic subunit delta isoform
LigandBDBM358652
Substrate/Competitorn/a
Meas. Tech.ADP-Glo Format PI3K Assay
IC50 0.200±n/a nM
Citation Bhide, RSBatt, DGCherney, RJCornelius, LALiu, QMarcoux, DNeels, JPoss, MARuan, ZShi, QSrivastava, ASQin, LTino, JAWatterson, SH Bicyclic heteroaryl amine compounds US Patent US10214537 Publication Date 2/26/2019
 
Phosphatidylinositol 4,5-bisphosphate 3-kinase catalytic subunit delta isoform
Name:Phosphatidylinositol 4,5-bisphosphate 3-kinase catalytic subunit delta isoform
Type:Enzyme Subunit
Mol. Mass.:119489.41
Organism:Homo sapiens (Human)
Description:O00329
Residue:1044
BDBM358652
NameBDBM358652
Synonyms:(R)-4-(4-amino-5-(trifluoromethyl) pyrrolo[2,1-f][1,2,4]triazin-7-yl)-2- (2,2,5-trimethyl-3-oxomorpholino) benzamide | US10214537, Example 729
TypeSmall organic molecule
Emp. Form.C21H21F3N6O3
Mol. Mass.462.425
SMILESC[C@@H]1COC(C)(C)C(=O)N1c1cc(ccc1C(N)=O)-c1cc(c2c(N)ncnn12)C(F)(F)F