Reaction Details
TargetPhosphatidylinositol 4,5-bisphosphate 3-kinase catalytic subunit delta isoform
LigandBDBM358674
Substrate/Competitorn/a
Meas. Tech.ADP-Glo Format PI3K Assay
IC50 0.500±n/a nM
Citation Bhide, RSBatt, DGCherney, RJCornelius, LALiu, QMarcoux, DNeels, JPoss, MARuan, ZShi, QSrivastava, ASQin, LTino, JAWatterson, SH Bicyclic heteroaryl amine compounds US Patent US10214537 Publication Date 2/26/2019
 
Phosphatidylinositol 4,5-bisphosphate 3-kinase catalytic subunit delta isoform
Name:Phosphatidylinositol 4,5-bisphosphate 3-kinase catalytic subunit delta isoform
Type:Enzyme Subunit
Mol. Mass.:119489.41
Organism:Homo sapiens (Human)
Description:O00329
Residue:1044
BDBM358674
NameBDBM358674
Synonyms:N-(3-(4-(5-(4-amino-5- (trifluoromethyl)pyrrolo[2,1-f][1,2,4] triazin-7-yl)-2-fluorophenyl)-2,2- dimethyl-3-oxopiperazin-1-yl)-3- oxopropyl)methanesulfonamide | US10214537, Example 751
TypeSmall organic molecule
Emp. Form.C23H25F4N7O4S
Mol. Mass.571.548
SMILESCC1(C)N(CCN(C1=O)c1cc(ccc1F)-c1cc(c2c(N)ncnn12)C(F)(F)F)C(=O)CCNS(C)(=O)=O