Reaction Details
TargetPhosphatidylinositol 4,5-bisphosphate 3-kinase catalytic subunit delta isoform
LigandBDBM358679
Substrate/Competitorn/a
Meas. Tech.ADP-Glo Format PI3K Assay
IC50 0.200±n/a nM
Citation Bhide, RSBatt, DGCherney, RJCornelius, LALiu, QMarcoux, DNeels, JPoss, MARuan, ZShi, QSrivastava, ASQin, LTino, JAWatterson, SH Bicyclic heteroaryl amine compounds US Patent US10214537 Publication Date 2/26/2019
 
Phosphatidylinositol 4,5-bisphosphate 3-kinase catalytic subunit delta isoform
Name:Phosphatidylinositol 4,5-bisphosphate 3-kinase catalytic subunit delta isoform
Type:Enzyme Subunit
Mol. Mass.:119489.41
Organism:Homo sapiens (Human)
Description:O00329
Residue:1044
BDBM358679
NameBDBM358679
Synonyms:N-(2-(4-(5-(4-amino-5-chloropyrrolo [2,1-f][1,2,4]triazin-7-yl)-2- fluorophenyl)-2,2-dimethyl-3- oxopiperazin-1-yl)-2-oxoethyl) acetamide | US10214537, Example 756
TypeSmall organic molecule
Emp. Form.C22H23ClFN7O3
Mol. Mass.487.915
SMILESCC(=O)NCC(=O)N1CCN(C(=O)C1(C)C)c1cc(ccc1F)-c1cc(Cl)c2c(N)ncnn12