Reaction Details
Target3-hydroxy-3-methylglutaryl-coenzyme A reductase
LigandBDBM18390
Substrate/CompetitorBDBM18373
Meas. Tech.HMG-CoA Reductase In Vitro Assay
pH7.2±n/a
Temperature310.15±n/a K
IC50 2.0±n/a nM
Citation Larsen, SDPoel, TJFilipski, KJKohrt, JTPfefferkorn, JASorenson, RJTait, BDAskew, VDillon, LHanselman, JCLu, GHRobertson, ASekerke, CKowala, MCAuerbach, BJ Pyrazole inhibitors of HMG-CoA reductase: An attempt to dramatically reduce synthetic complexity through minimal analog re-design. Bioorg Med Chem Lett17:5567-72 (2007) 
 
3-hydroxy-3-methylglutaryl-coenzyme A reductase
Name:3-hydroxy-3-methylglutaryl-coenzyme A reductase
Type:Enzyme
Mol. Mass.:96689.85
Organism:Rattus norvegicus (rat)
Description:Isolated rat liver microsomes were used as enzyme source.
Residue:887
BDBM18390
BDBM18373
NameBDBM18390
Synonyms:(3R,5S)-6-[(3-{[(2,3-difluorophenyl)methyl]carbamoyl}-1-(4-fluorophenyl)-4-(propan-2-yl)-1H-pyrazol-5-yl)oxy]-3,5-dihydroxyhexanoic acid | oxypyrazole, 4c
TypeSmall organic molecule
Emp. Form.C26H28F3N3O6
Mol. Mass.535.5122
SMILESCC(C)c1c(OC[C@@H](O)C[C@@H](O)CC(O)=O)n(nc1C(=O)NCc1cccc(F)c1F)-c1ccc(F)cc1