Reaction Details
Target3-hydroxy-3-methylglutaryl-coenzyme A reductase
LigandBDBM18424
Substrate/CompetitorBDBM18373
Meas. Tech.HMG-CoA Reductase In Vitro Assay
IC50 6.2±n/a nM
Citation Larsen, SDPoel, TJFilipski, KJKohrt, JTPfefferkorn, JASorenson, RJTait, BDAskew, VDillon, LHanselman, JCLu, GHRobertson, ASekerke, CKowala, MCAuerbach, BJ Pyrazole inhibitors of HMG-CoA reductase: An attempt to dramatically reduce synthetic complexity through minimal analog re-design. Bioorg Med Chem Lett17:5567-72 (2007) 
 
3-hydroxy-3-methylglutaryl-coenzyme A reductase
Name:3-hydroxy-3-methylglutaryl-coenzyme A reductase
Type:Enzyme
Mol. Mass.:96689.85
Organism:Rattus norvegicus (rat)
Description:Isolated rat liver microsomes were used as enzyme source.
Residue:887
BDBM18424
BDBM18373
NameBDBM18424
Synonyms:(3R,5R)-7-{3-[benzyl(methyl)carbamoyl]-1-(4-fluorophenyl)-4-(propan-2-yl)-1H-pyrazol-5-yl}-3,5-dihydroxyheptanoic acid | pyrazole, 3b
TypeSmall organic molecule
Emp. Form.C28H34FN3O5
Mol. Mass.511.5851
SMILESCC(C)c1c(CC[C@@H](O)C[C@@H](O)CC(O)=O)n(nc1C(=O)N(C)Cc1ccccc1)-c1ccc(F)cc1