Reaction Details
TargetTyrosine-protein kinase BTK
LigandBDBM359002
Substrate/Competitorn/a
Meas. Tech.Btk Enzyme Activity Assay
IC50 0.140±n/a nM
Citation Liu, JKozlowski, JABoga, SBGao, XGuiadeen, DGCai, JLiu, SWang, DWu, HYang, C Btk inhibitors US Patent US10214546 Publication Date 2/26/2019
 
Tyrosine-protein kinase BTK
Name:Tyrosine-protein kinase BTK
Type:Enzyme
Mol. Mass.:76289.95
Organism:Homo sapiens (Human)
Description:Q06187
Residue:659
BDBM359002
NameBDBM359002
Synonyms:(6R,8aS)-6-[8-amino-5- chloro-1-(4-{(1R)-1-[3- (difluoromethyl)phenyl]-1- hydroxyethyl}phenyl) imidazo[1,5-a]|pyrazin-3- yl]hexahydroindolizin- 3(2H)-one | US10214546, Example 134
TypeSmall organic molecule
Emp. Form.C29H28ClF2N5O2
Mol. Mass.552.015
SMILESC[C@@](O)(c1ccc(cc1)-c1nc([C@@H]2CC[C@H]3CCC(=O)N3C2)n2c(Cl)cnc(N)c12)c1cccc(c1)C(F)F