Reaction Details
TargetTyrosine-protein kinase BTK
LigandBDBM359045
Substrate/Competitorn/a
Meas. Tech.Btk Enzyme Activity Assay
IC50 0.100±n/a nM
Citation Liu, JKozlowski, JABoga, SBGao, XGuiadeen, DGCai, JLiu, SWang, DWu, HYang, C Btk inhibitors US Patent US10214546 Publication Date 2/26/2019
 
Tyrosine-protein kinase BTK
Name:Tyrosine-protein kinase BTK
Type:Enzyme
Mol. Mass.:76289.95
Organism:Homo sapiens (Human)
Description:Q06187
Residue:659
BDBM359045
NameBDBM359045
Synonyms:(6R,8aS)-6-[8-amino-1- (4-{(1R)-1-[3- (difluoromethyl)phenyl]-1- hydroxyethyl}phenyl) imidazo[1,5-a]pyrazin- 3-yl]-1,1- dimethylhexahydroindolizin- 3(2H)-one | US10214546, Example 177
TypeSmall organic molecule
Emp. Form.C31H33F2N5O2
Mol. Mass.545.6228
SMILESC[C@@](O)(c1ccc(cc1)-c1nc([C@@H]2CC[C@@H]3N(C2)C(=O)CC3(C)C)n2ccnc(N)c12)c1cccc(c1)C(F)F