Reaction Details
TargetLysosomal acid glucosylceramidase
LigandBDBM18432
Substrate/CompetitorBDBM18429
Meas. Tech.GC Enzyme Assay
pH5.9±n/a
Temperature294.15±n/a K
Ki 121±n/a nM
IC50 183±n/a nM
Km28000±n/a nM
Citation Zheng, WPadia, JUrban, DJJadhav, AGoker-Alpan, OSimeonov, AGoldin, EAuld, DLaMarca, MEInglese, JAustin, CPSidransky, E Three classes of glucocerebrosidase inhibitors identified by quantitative high-throughput screening are chaperone leads for Gaucher disease. Proc Natl Acad Sci U S A104:13192-7 (2007) 
 
Lysosomal acid glucosylceramidase
Name:Lysosomal acid glucosylceramidase
Type:Enzyme
Mol. Mass.:59724.64
Organism:Homo sapiens (Human)
Description:The beta-Glu activity was measured with commercially available beta-glucocerebrosidase (Ceredase) as the enzyme source.
Residue:536
BDBM18432
BDBM18429
NameBDBM18432
Synonyms:Aminoquinoline compound, 17 | N-[4-methyl-2-(morpholin-4-yl)quinolin-6-yl]cyclopropanecarboxamide
TypeSmall organic molecule
Emp. Form.C18H21N3O2
Mol. Mass.311.3782
SMILESCc1cc(nc2ccc(NC(=O)C3CC3)cc12)N1CCOCC1