Reaction Details
TargetLysosomal acid glucosylceramidase
LigandBDBM18444
Substrate/CompetitorBDBM18429
Meas. Tech.GC Enzyme Assay
pH5.9±n/a
Temperature294.15±n/a K
Ki 23400±n/a nM
IC50 34400±n/a nM
Km28000±n/a nM
Citation Zheng, WPadia, JUrban, DJJadhav, AGoker-Alpan, OSimeonov, AGoldin, EAuld, DLaMarca, MEInglese, JAustin, CPSidransky, E Three classes of glucocerebrosidase inhibitors identified by quantitative high-throughput screening are chaperone leads for Gaucher disease. Proc Natl Acad Sci U S A104:13192-7 (2007) 
 
Lysosomal acid glucosylceramidase
Name:Lysosomal acid glucosylceramidase
Type:Enzyme
Mol. Mass.:59724.64
Organism:Homo sapiens (Human)
Description:The beta-Glu activity was measured with commercially available beta-glucocerebrosidase (Ceredase) as the enzyme source.
Residue:536
BDBM18444
BDBM18429
NameBDBM18444
Synonyms:4-[benzene(methyl)sulfonamido]-N-(1,3-thiazol-2-yl)benzamide cid_1309992
TypeSmall organic molecule
Emp. Form.C17H15N3O3S2
Mol. Mass.373.449
SMILESCN(c1ccc(cc1)C(=O)Nc1nccs1)S(=O)(=O)c1ccccc1