Reaction Details
TargetLysosomal acid glucosylceramidase
LigandBDBM18446
Substrate/CompetitorBDBM18429
Meas. Tech.GC Enzyme Assay
pH5.9±n/a
Temperature294.15±n/a K
Ki 50600±n/a nM
IC50>100000±n/a nM
Km28000±n/a nM
Citation Zheng, WPadia, JUrban, DJJadhav, AGoker-Alpan, OSimeonov, AGoldin, EAuld, DLaMarca, MEInglese, JAustin, CPSidransky, E Three classes of glucocerebrosidase inhibitors identified by quantitative high-throughput screening are chaperone leads for Gaucher disease. Proc Natl Acad Sci U S A104:13192-7 (2007) 
 
Lysosomal acid glucosylceramidase
Name:Lysosomal acid glucosylceramidase
Type:Enzyme
Mol. Mass.:59724.64
Organism:Homo sapiens (Human)
Description:The beta-Glu activity was measured with commercially available beta-glucocerebrosidase (Ceredase) as the enzyme source.
Residue:536
BDBM18446
BDBM18429
NameBDBM18446
Synonyms:4-benzenesulfonamido-N-benzylbenzamide | Sulfonamide analogue, 26
TypeSmall organic molecule
Emp. Form.C20H18N2O3S
Mol. Mass.366.434
SMILESO=C(NCc1ccccc1)c1ccc(NS(=O)(=O)c2ccccc2)cc1