Reaction Details
TargetLysosomal acid glucosylceramidase
LigandBDBM18448
Substrate/CompetitorBDBM18429
Meas. Tech.GC Enzyme Assay
pH5.9±n/a
Temperature294.15±n/a K
Ki 2780±n/a nM
IC50 4310±n/a nM
Km28000±n/a nM
Citation Zheng, WPadia, JUrban, DJJadhav, AGoker-Alpan, OSimeonov, AGoldin, EAuld, DLaMarca, MEInglese, JAustin, CPSidransky, E Three classes of glucocerebrosidase inhibitors identified by quantitative high-throughput screening are chaperone leads for Gaucher disease. Proc Natl Acad Sci U S A104:13192-7 (2007) 
 
Lysosomal acid glucosylceramidase
Name:Lysosomal acid glucosylceramidase
Type:Enzyme
Mol. Mass.:59724.64
Organism:Homo sapiens (Human)
Description:The beta-Glu activity was measured with commercially available beta-glucocerebrosidase (Ceredase) as the enzyme source.
Residue:536
BDBM18448
BDBM18429
NameBDBM18448
Synonyms:2-({4-[(3-methylphenyl)amino]-6-(pyrrolidin-1-yl)-1,3,5-triazin-2-yl}amino)ethan-1-ol triazine scaffold, 26
TypeSmall organic molecule
Emp. Form.C16H22N6O
Mol. Mass.314.3855
SMILESCc1cccc(Nc2nc(NCCO)nc(n2)N2CCCC2)c1