Reaction Details
TargetAndrogen receptor
LigandBDBM18534
Substrate/CompetitorBDBM18161
Meas. Tech.AR Transcriptional Activation Assay and MDA Whole-Cell Binding Assay
pH7.4±n/a
Temperature310.15±n/a K
Ki 6.3±n/a nM
EC50 1.9±0.7 nM
CommentshAR agonist efficacy = 81 +/- 8 %.
Citation van Oeveren, AMotamedi, MMani, NSMarschke, KBLópez, FJSchrader, WTNegro-Vilar, AZhi, L Discovery of 6-N,N-bis(2,2,2-trifluoroethyl)amino- 4-trifluoromethylquinolin-2(1H)-one as a novel selective androgen receptor modulator. J Med Chem49:6143-6 (2006) 
 
Androgen receptor
Name:Androgen receptor
Type:Receptor
Mol. Mass.:99185.27
Organism:Homo sapiens (Human)
Description:CHO cells were stably transfected with human AR gene.
Residue:920
BDBM18534
BDBM18161
NameBDBM18534
Synonyms:6-[bis(cyclopropylmethyl)amino]-4-(trifluoromethyl)-1,2-dihydroquinolin-2-one | 6-dialkylamino-4-trifluoromethylquinolin-2(1H)-one, 4h
TypeSmall organic molecule
Emp. Form.C18H19F3N2O
Mol. Mass.336.3515
SMILESFC(F)(F)c1cc(=O)[nH]c2ccc(cc12)N(CC1CC1)CC1CC1