Reaction Details
TargetAndrogen receptor
LigandBDBM18548
Substrate/CompetitorBDBM18161
Meas. Tech.AR Transcriptional Activation Assay and MDA Whole-Cell Binding Assay
pH7.4±n/a
Temperature310.15±n/a K
Ki 118±46 nM
IC50 122±30 nM
CommentshAR antagonist efficacy = 92 +/- 1 %.
Citation van Oeveren, APio, BATegley, CMHiguchi, RIWu, MJones, TKMarschke, KBNegro-Vilar, AZhi, L Discovery of an androgen receptor modulator pharmacophore based on 2-quinolinones. Bioorg Med Chem Lett17:1523-6 (2007) 
 
Androgen receptor
Name:Androgen receptor
Type:Receptor
Mol. Mass.:99185.27
Organism:Homo sapiens (Human)
Description:CHO cells were stably transfected with human AR gene.
Residue:920
BDBM18548
BDBM18161
NameBDBM18548
Synonyms:7-[(2-methylbut-3-en-2-yl)amino]-4-(trifluoromethyl)-1,2-dihydroquinolin-2-one | alkylamino-2-quinolinone, 9h
TypeSmall organic molecule
Emp. Form.C15H15F3N2O
Mol. Mass.296.2876
SMILESCC(C)(Nc1ccc2c(cc(=O)[nH]c2c1)C(F)(F)F)C=C