Reaction Details
TargetAndrogen receptor
LigandBDBM18606
Substrate/CompetitorBDBM18161
Meas. Tech.AR Transcriptional Activation Assay and MDA Whole-Cell Binding Assay
Ki 0.5±n/a nM
EC50 0.89±n/a nM
Citation van Oeveren, AMotamedi, MMartinborough, EZhao, SShen, YWest, SChang, WKallel, AMarschke, KBLópez, FJNegro-Vilar, AZhi, L Novel selective androgen receptor modulators: SAR studies on 6-bisalkylamino-2-quinolinones. Bioorg Med Chem Lett17:1527-31 (2007) 
 
Androgen receptor
Name:Androgen receptor
Type:Receptor
Mol. Mass.:99185.27
Organism:Homo sapiens (Human)
Description:CHO cells were stably transfected with human AR gene.
Residue:920
BDBM18606
BDBM18161
NameBDBM18606
Synonyms:6-[bis(2,2,2-trifluoroethyl)amino]-4-chloro-1,2-dihydroquinolin-2-one | 6-bisalkylamino-2-quinolinone, 7g
TypeSmall organic molecule
Emp. Form.C13H9ClF6N2O
Mol. Mass.358.667
SMILESFC(F)(F)CN(CC(F)(F)F)c1ccc2[nH]c(=O)cc(Cl)c2c1