Reaction Details
TargetGlucocorticoid receptor
LigandBDBM18626
Substrate/CompetitorBDBM18207
Meas. Tech.Competitive Ligand Binding Assay, GR-Mediated Agonist Activity Assay, and IL-6 Repression Assay
pH7.5±n/a
Temperature277.15±n/a K
Ki 4.4±n/a nM
IC50 6.1±n/a nM
EC50 0.5±0.1 nM
CommentsGRE activation agonist mode efficacy is 20 +/- 1.8 %.
Citation Hudson, ARRoach, SLHiguchi, RIPhillips, DPBissonnette, RPLamph, WWYen, JLi, YAdams, MEValdez, LJVassar, ACuervo, CKallel, EAGharbaoui, CJMais, DEMiner, JNMarschke, KBRungta, DNegro-Vilar, AZhi, L Synthesis and characterization of nonsteroidal glucocorticoid receptor modulators for multiple myeloma. J Med Chem50:4699-709 (2007) 
 
Glucocorticoid receptor
Name:Glucocorticoid receptor
Type:Enzyme
Mol. Mass.:85656.87
Organism:Homo sapiens (Human)
Description:P04150
Residue:777
BDBM18626
BDBM18207
NameBDBM18626
Synonyms:(18Z)-12-methoxy-3,5,5-trimethyl-18-({3-[(2E)-pent-2-en-2-yl]thiophen-2-yl}methylidene)-17-oxa-6-azatetracyclo[8.8.0.0^{2,7}.0^{11,16}]octadeca-1(10),2(7),3,8,11,13,15-heptaen-13-ol | Alkene, 29
TypeSmall organic molecule
Emp. Form.C30H31NO3S
Mol. Mass.485.637
SMILESCC\C=C(/C)c1ccsc1\C=C1/Oc2ccc(O)c(OC)c2-c2ccc3NC(C)(C)C=C(C)c3c12