Reaction Details
TargetMineralocorticoid receptor
LigandBDBM18623
Substrate/CompetitorBDBM18207
Meas. Tech.Competitive Ligand Binding Assay, GR-Mediated Agonist Activity Assay, and IL-6 Repression Assay
Ki 48±n/a nM
Citation Hudson, ARRoach, SLHiguchi, RIPhillips, DPBissonnette, RPLamph, WWYen, JLi, YAdams, MEValdez, LJVassar, ACuervo, CKallel, EAGharbaoui, CJMais, DEMiner, JNMarschke, KBRungta, DNegro-Vilar, AZhi, L Synthesis and characterization of nonsteroidal glucocorticoid receptor modulators for multiple myeloma. J Med Chem50:4699-709 (2007) 
 
Mineralocorticoid receptor
Name:Mineralocorticoid receptor
Type:Enzyme
Mol. Mass.:107076.42
Organism:Homo sapiens (Human)
Description:P08235
Residue:984
BDBM18623
BDBM18207
NameBDBM18623
Synonyms:(18Z)-12-methoxy-18-({3-[(1E)-1-(methoxyimino)ethyl]thiophen-2-yl}methylidene)-3,5,5-trimethyl-17-oxa-6-azatetracyclo[8.8.0.0^{2,7}.0^{11,16}]octadeca-1(10),2(7),3,8,11,13,15-heptaen-13-ol | Oxime, 23
TypeSmall organic molecule
Emp. Form.C28H28N2O4S
Mol. Mass.488.598
SMILESCO\N=C(/C)c1ccsc1\C=C1/Oc2ccc(O)c(OC)c2-c2ccc3NC(C)(C)C=C(C)c3c12