Reaction Details
TargetNuclear receptor ROR-gamma
LigandBDBM359551
Substrate/Competitorn/a
Meas. Tech.Biological Assay
IC50 0.800±n/a nM
Citation Lapointe, BTFuller, PHGunaydin, HLiu, KSciammetta, NTrotter, BWZhang, HBarr, KJMaclean, JKMolinari, DFSimov, V Substituted pyrazole compounds as RORgammaT inhibitors and uses thereof US Patent US10221142 Publication Date 3/5/2019
 
Nuclear receptor ROR-gamma
Name:Nuclear receptor ROR-gamma
Type:Enzyme Catalytic Domain
Mol. Mass.:58218.40
Organism:Homo sapiens (Human)
Description:P51449
Residue:518
BDBM359551
NameBDBM359551
Synonyms:4-[(6R or S)-1-({2- chloro-6-[1- (difluoromethyl)cyclo propyl]phenyl)car- bonyl)-6-{[(3S,4R)-3- fluoro-4- hydroxypyrrolidin-1- yl]carbonyl}-4,5,6,7- tetrahydro-1H- indazol-3-yl]-3- fluorobenzoic acid | US10221142, Example 21Q
TypeSmall organic molecule
Emp. Form.C30H26ClF4N3O5
Mol. Mass.619.991
SMILESO[C@@H]1CN(C[C@@H]1F)C(=O)C1CCc2c(C1)n(nc2-c1ccc(cc1F)C(O)=O)C(=O)c1c(Cl)cccc1C1(CC1)C(F)F