Reaction Details
TargetNuclear receptor ROR-gamma
LigandBDBM359564
Substrate/Competitorn/a
Meas. Tech.Biological Assay
IC50 0.900±n/a nM
Citation Lapointe, BTFuller, PHGunaydin, HLiu, KSciammetta, NTrotter, BWZhang, HBarr, KJMaclean, JKMolinari, DFSimov, V Substituted pyrazole compounds as RORgammaT inhibitors and uses thereof US Patent US10221142 Publication Date 3/5/2019
 
Nuclear receptor ROR-gamma
Name:Nuclear receptor ROR-gamma
Type:Enzyme Catalytic Domain
Mol. Mass.:58218.40
Organism:Homo sapiens (Human)
Description:P51449
Residue:518
BDBM359564
NameBDBM359564
Synonyms:(R or S)-4-(1-(2- chloro-6-(1- (trifluoromethyl)cyclo- propyl)benzoyl)-6- (methyl(2-(1-methyl- 1H-pyrazol-4- yl)ethyl)carbamoyl)- 4,5,6,7-tetrahydro- 1H-indazol-3-yl)-3- fluorobenzoic acid | US10221142, Example 21DD
TypeSmall organic molecule
Emp. Form.C33H30ClF4N5O4
Mol. Mass.672.069
SMILESCN(CCc1cnn(C)c1)C(=O)C1CCc2c(C1)n(nc2-c1ccc(cc1F)C(O)=O)C(=O)c1c(Cl)cccc1C1(CC1)C(F)(F)F