Reaction Details
TargetAndrogen receptor
LigandBDBM18661
Substrate/CompetitorBDBM26258
Meas. Tech.Competitive Radioligand Displacement Assay
pH7.4±n/a
Temperature277.15±n/a K
Ki 4.9±0.2 nM
CommentsCompound nM stimulates transcription to 50% of that observed with 1 nM DHT.
Citation Marhefka, CAGao, WChung, KKim, JHe, YYin, DBohl, CDalton, JTMiller, DD Design, synthesis, and biological characterization of metabolically stable selective androgen receptor modulators. J Med Chem47:993-8 (2004) 
 
Androgen receptor
Name:Androgen receptor
Type:Enzyme
Mol. Mass.:98219.08
Organism:Rattus norvegicus (Rat)
Description:P15207
Residue:902
BDBM18661
BDBM26258
NameBDBM18661
Synonyms:(2R)-3-[(4-acetamidophenyl)sulfanyl]-2-hydroxy-2-methyl-N-[4-nitro-3-(trifluoromethyl)phenyl]propanamide | Nonsteroidal AR Ligand, R-2
TypeSmall organic molecule
Emp. Form.C19H18F3N3O5S
Mol. Mass.457.424
SMILESCC(=O)Nc1ccc(SC[C@](C)(O)C(=O)Nc2ccc(c(c2)C(F)(F)F)[N+]([O-])=O)cc1